Fatal Error X11/xlib.h Ubuntu

NS-2.35 install in Ubuntu 14.04

RECOMMENDED: If you have Windows errors then we strongly recommend that you download and run this (Windows) Repair Tool.

Vaillant Ecotec Plus F28 Error Ontsteking probleem Vaillant ECOTEC PRO VCW 286 – Klusidee – Dag Allemaal, Ik heb een probleem met een viallant ecotec

hi. i am using ubuntu 12.04 and trying to install NS2.35 for that matter i downloaded ns-allinone-2.35, unzipped it, started installation, the installation went well.

Multivariate Error Error Establishing Socket. Connection Refused Connect Apr 13, 2016. SQLException: Network error IOException: Connection refused: connect at net. sourceforge.jtds.jdbc.ConnectionJDBC2. 172

Oct 5, 2011. I'm trying to install i3wm (v. 4.0.2) on F16 x86_64. I checked the dependencies for i3 from the repo and installed all of them. While trying to issue 'make' I still get the error: include/xcursor.h:7:22: fatal error: X11/Xlib.h: No such file or directory Having googled it, it'd think I have to install xorg-x11-devel.

Oct 16, 2014. You will need to install the prerequisite X11 development libraries – the particular error you are getting at this point should be solved by installing libx11-dev but there may be others. You will also likely need to change the library link order on your command line, since newer versions of the gcc compiler.

Then it says fatal error. I have made sure it was on and can interact with my desktop. Also, I got this other error “error 1603: a fatal error occurred during installation”. Are they related? I would like to fix them both if possible.

ownCloud 9.0.2 Released with Lower-Severity Security Patches and Hardenings – Thus, they are bringing fixes for reported bugs, as well as various lower-severity security patches and hardenings. especially during upgrades, the error messages about the latest ownCloud version were resolved, a fatal PHP error.

Smtp Error Could Not Authenticate Phpmailer Gmail Galaxy S6 can’t send out emails when using wifi, mobile data stopped working, other issues – If you can, kindly

X11/Xlib.h not found in Ubuntu. Ask Question. up vote 40 down vote favorite. 13. test.cpp:1:22: fatal error: X11/Xlib.h: No such file or directory compilation.

I'm trying to install something called morse2led. I believe that it is possible on ubuntu, but seem to be having difficulty. Please forgive my ignorance, but this is.

7 results. /usr/lib/TenDRA/lib/include/x5/lib.api/X11/Xlib.h, tendra [not amd64]. /usr/lib/i386- linux-gnu/root5.34/cint/include/X11/Xlib.h, libroot-core5.34 [not amd64]. /usr/lib/ x86_64-linux-gnu/root5.34/cint/include/X11/Xlib.h, libroot-core5.34 [not i386]. /usr /share/emscripten/system/include/X11/Xlib.h, emscripten.

Mar 1, 2011. PLEASE HELP ME AS SOON AS POSSIBLE… Reply. Pranesh Paul. Wednesday , December 21, 2011 at 8:14 · Reply. i have a problem when i install ns2.33 in ubuntu10.10 /home/pranesh/ns-allinone-2.33/tk8.4.18/unix/./generic/tk.h:81: fatal error: X11/Xlib.h: No such file or directory. make: *** [tk3d.o] Error.

[SOLVED] fatal error: X11/Xlib.h: No such file or directory –. fatal error: X11/Xlib.h: No such file or directory. fatal error: X11/Xlib.h:. that link is about UBUNTU this is LFS please stop posting fixes for.

Error while installing libX11-devel, fatal error: X11/Xlib.h:. If you do a search for Synaptic in Ubuntu Software Center and it comes up you will see a.

make – X11/Xlib.h: No such file or directory – Unix & Linux Stack. – Mar 20, 2013. Then I exported the path to the header files and when I use which command to find Xlib.h,it locates ths file. >which Xlib.h ~/include/X11/Xlib.h. Now, when I try to install tk again configure works fine as usual but I get the same error again while using make X11/Xlib.h: No such file or directory. Please help me.

log-level string Set the logging level ("debug", "info", "warn", "error", "fatal") (default "info") –tls Use TLS; implied by –tlsverify –tlscacert string Trust certs signed.

generic/tk.h:96:25: fatal error: X11/Xlib.h: No such file or directory # include <X11/ Xlib.h> ^ compilation terminated. make: *** [Makefile:1160: tkStubLib.o]. that link is about UBUNTU this is LFS please stop posting fixes for debian based distros those solutions will NOT work with lfs as it doesn't use apt.

I tried to install NS2.35 in my newly installed ubuntu(I am new to it). I have got following error: In file included from /home/user/Desktop/ns-allinon

"I am because you are, and you are because I am." That’s the loose translation of the South African philosophy of ubuntu given in the play of the same name, a 2009 collective creation that’s toured Canada and now makes its first appearance.

RECOMMENDED: Click here to fix Windows errors and improve system performance