Failed With Error Code 32512

RECOMMENDED: If you have Windows errors then we strongly recommend that you download and run this (Windows) Repair Tool.

Sometimes Windows Server Backup failed to backup the data. The error is: The shared restore point operation failed with error (0x81000101) The creation of.

Jun 17, 2012. Hi Gurus, I have a tpump execution through command task. And intermittently it fails with an exit code [-1073741819]. (not always it fails) Kindly.

Jessica Yu – registration had failed (because register_kprobe() returned an error), along with the propagated error code. This patchset was based on Petr Mladek’s original patchset (patches 2 and 3) kprobes: propagate error from arm_kprobe_ftrace().

My web app: ASP.Net 4.5, MS SQL Server 2008 R2,Bootstrap working fine on local server but on live server it gives error: Compiler Error Message: The compiler failed.

My claim contains HCPCS code C9399 (Unclassified drugs or biologicals), and received reason code 32512 indicating the associated units must be equal to.

Republicans have pinned their hopes of maintaining their majority on Capitol Hill in.

Success responses: A 2xx status code indicates that the client’s request was successfully received, understood, and accepted. Error responses Error codes Any response with a status code indicating an error (4xx or 5xx) includes an.

Serial Number Criteria: Description Criteria: B-25 Data last updated: Tue Mar 15 09:25:04 2016 37-51. 37-51 Douglas DB-1 MSN 1353. Delivered to Wright Field Aug 1935.

After downloading the code I attempt to create a new case:. ERROR: env CCSMUSER=myname CASE=test01. failed: 32512. Any ideas on.

Sql Server Error 17 Server Does Not Exist Diagnosing Connection to SQL Server – Stack Overflow – May 25, 2016 · Diagnosing Connection to SQL Server. Connection failed:

Here was the error: The SaveToSQLServer method has encountered OLE DB.

preinstall" in /private/tmp/PKInstallSandbox.czJUI8/Scripts/com.nvidia.web-driver.mlW8oN 2017-09-30 12:49:31+01 UNKNOWN installd[447]: PackageKit:.

System Error Codes (1300-1699) System Error Codes (0-499). ERROR_CREATE_FAILED 1631 (0x65F) The Windows Installer service failed to start.

pigs protocol – abyz.co.uk – pigpio pigpio C I/F pigpiod pigpiod C I/F Python pigs piscope Misc Examples Download FAQ Site Map: pigs Introduction The socket and pipe interfaces allow control of.

Microsoft Access 2007 comprehensive list all Error Numbers and Descriptions

Database re-provisioning failed with the exception ‘SqlException Error Code:.

Dec 23, 2011. The code that coordinates processing the input goes and finds its own DBs. – opycallgraph.png /tmp/tmpiS5FXK” failed with error code 32512.

General Notes on System Tuning. Tuning a system requires a carefully planned proceeding. Learn which steps are necessary to successfully improve your system.

[SOLVED]Problems Building Aster 11.3 with acml and openmpi. – [FAILED] Exit code : 32512 /home/maldun/Salome_Meca/Code_Aster/GNU_acml /11/PAR11.3/asteru: error while loading shared libraries:.

SBS 2008 backup failed error code 2155348001. Windows Small Business Server > Small Business Server.

problem running ODM – parallel –halt-on-error 1 -j+0. Hi everybody. returned with code 32512. My OS is Debian. Failed to read image:

When I tried to register a COM DLL, regsvr32 rpcrt4.dll I get the following error message: `The module "c:\windows\system 32\"rpcrt4.dll" was loaded but the call to.

Sorry, if you cannot follow the directions for setup and then provide some useful infromation beyond "cannot be able to apply". The setup is all there. That chapter.

Compiler Error Message: The compiler failed with error. http://forums.iis.net/t/1159648.aspx?Compiler+Error+Message+The+compiler+failed+with+error+code+.

Error Could Not Bind Socket To Interface This module provides access to the BSD socket interface. It is available on all modern Unix systems, Windows, MacOS, and

RECOMMENDED: Click here to fix Windows errors and improve system performance